Target
Fatty acid synthase
Ligand
BDBM244758
Substrate
Meas. Tech.
Biochemical Assay
Temperature
277.15±n/a K
IC50
12±n/a nM
Comments
extracted
Citation
 Oslob, JDMcDowell, RSJohnson, RYang, HEvanchik, MZaharia, CACai, HHu, LWWagman, AS Heterocyclic modulators of lipid synthesis US Patent  US9428502 Publication Date 8/30/2016 
Target
Name:
Fatty acid synthase
Synonyms:
FAS FAS_HUMAN HU FASN
Type:
Enzyme
Mol. Mass.:
273419.37
Organism:
Homo sapiens (Human)
Description:
P49327
Residue:
2511
  
Inhibitor
Name:
BDBM244758
Synonyms:
US10226449, cpd 368 | US9428502, 368
Type:
Small organic molecule
Emp. Form.:
C23H18F4N4O
Mol. Mass.:
442.4088
SMILES:
Cc1nc(c([nH]1)-c1cc(ccc1C)C(=O)N1CC(F)(C1)c1ccc(cc1)C#N)C(F)(F)F
: