Target
Parathyroid hormone [32-65]
Ligand
BDBM64569
Substrate
Meas. Tech.
cAMP Assay
pH
7.4±n/a
EC50
4800±n/a nM
Comments
extracted
Citation
 Nishimura, YEsaki, TTamura, T Hydantoin derivative US Patent  US9428505 Publication Date 8/30/2016 
Target
Name:
Parathyroid hormone [32-65]
Synonyms:
PTH Parathyroid hormone (PTH)
Type:
Enzyme
Mol. Mass.:
4120.23
Organism:
Homo sapiens (Human)
Description:
Human PTH(1-34) purchased from Peptide Institute, Inc.
Residue:
34
  
Inhibitor
Name:
BDBM64569
Synonyms:
US9428505, Comparative: Example 1
Type:
Emp. Form.:
C26H26F3N5O6S
Mol. Mass.:
593.575
SMILES:
Cc1cc(ccc1CCS(=O)(=O)N1CCC2(CC1)N=C(NC2=O)c1cccc(OC(F)(F)F)c1)N1C(=O)CNC1=O
: