Target
Protein-tyrosine kinase 2-beta
Ligand
BDBM245637
Substrate
Meas. Tech.
Biochemical Assay
IC50
<20±n/a nM
Citation
 Xiao, DCheng, LLiu, XHu, YXu, XLiu, ZZhang, LWu, WWang, SShen, YLi, GWang, YZhao, SLi, CTang, JYu, H 2,4-diamino-6,7-dihydro-5H-pyrrolo[2,3]pyrimidine derivatives as FAK/Pyk2 inhibitors US Patent  US9428508 Publication Date 8/30/2016 
Target
Name:
Protein-tyrosine kinase 2-beta
Synonyms:
FAK2 PTK2B PTK2B protein tyrosine kinase 2 beta (PTK2B) Protein tyrosine kinase 2 beta | RAFTK
Type:
Protein
Mol. Mass.:
115868.80
Organism:
Homo sapiens (Human)
Description:
Q14289
Residue:
1009
  
Inhibitor
Name:
BDBM245637
Synonyms:
US9428508, 92
Type:
Small organic molecule
Emp. Form.:
C32H44N8O3S
Mol. Mass.:
620.809
SMILES:
COc1cc(ccc1Nc1nc2NCCc2c(Nc2ccccc2S(=O)(=O)NC(C)C)n1)N1CCC(CC1)N1CCCCC1
: