Target
Bromodomain-containing protein 4 [44-168]
Ligand
BDBM245799
Substrate
Meas. Tech.
AlphaScreen Assay
IC50
123±n/a nM
Citation
 Engelhardt, H Triazolopyrazine US Patent  US9428513 Publication Date 8/30/2016 
Target
Name:
Bromodomain-containing protein 4 [44-168]
Synonyms:
BET bromodomain 4(1) (BRD4(1)) BRD4-BD1 protein (aa 44-168) Bromodomain protein 4 (BRD4-BD1) Bromodomain-containing protein 4 (BRD4) (aa 44-168) Bromodomain-containing protein 4 bromodomain 1 (BRD4-BD1) | HUNK1
Type:
Enzyme Catalytic Domain
Mol. Mass.:
14866.49
Organism:
Homo sapiens (Human)
Description:
aa (44-168)
Residue:
125
  
Inhibitor
Name:
BDBM245799
Synonyms:
US9428513, I-15
Type:
Small organic molecule
Emp. Form.:
C23H31N7O
Mol. Mass.:
421.5385
SMILES:
COC[C@H](C)n1c(nc2ccc(cc12)C(C)C)-c1cn2c(C)nnc2c(NC(C)C)n1
: