Target
Bromodomain-containing protein 4 [352-457]
Ligand
BDBM245821
Substrate
Meas. Tech.
Time-Resolved Fluorescence Resonance Energy Transfer (TR-FRET) Assay
pH
6±n/a
Temperature
298.15±n/a K
Ki
63.2±n/a nM
Comments
extracted
Citation
 Bogdan, AKati, WMMcDaniel, KFPark, CHSheppard, GSWang, L Bromodomain inhibitors US Patent  US9428514 Publication Date 8/30/2016 
Target
Name:
Bromodomain-containing protein 4 [352-457]
Synonyms:
BRD4 Bromodomain-containing protein 4 (BRD4) Bromodomain-containing protein 4 (BRD4-BD2) | HUNK1
Type:
Enzyme Catalytic Domain
Mol. Mass.:
12432.37
Organism:
Homo sapiens (Human)
Description:
BDII: amino acid E352-M457
Residue:
106
  
Inhibitor
Name:
BDBM245821
Synonyms:
US9428514, 9
Type:
Small organic molecule
Emp. Form.:
C26H26F2N4O3
Mol. Mass.:
480.5064
SMILES:
CCOc1cc(=O)n(C)cc1-c1cc(NCCCn2cccn2)ccc1Oc1ccc(F)cc1F
: