Target
Bromodomain-containing protein 4 [352-457]
Ligand
BDBM245887
Substrate
Meas. Tech.
Time-Resolved Fluorescence Resonance Energy Transfer (TR-FRET) Assay
pH
6±n/a
Temperature
298.15±n/a K
Ki
47.8±n/a nM
Comments
extracted
Citation
 Bogdan, AKati, WMMcDaniel, KFPark, CHSheppard, GSWang, L Bromodomain inhibitors US Patent  US9428514 Publication Date 8/30/2016 
Target
Name:
Bromodomain-containing protein 4 [352-457]
Synonyms:
BRD4 Bromodomain-containing protein 4 (BRD4) Bromodomain-containing protein 4 (BRD4-BD2) | HUNK1
Type:
Enzyme Catalytic Domain
Mol. Mass.:
12432.37
Organism:
Homo sapiens (Human)
Description:
BDII: amino acid E352-M457
Residue:
106
  
Inhibitor
Name:
BDBM245887
Synonyms:
US9428514, 75
Type:
Small organic molecule
Emp. Form.:
C30H30F2N2O5S
Mol. Mass.:
568.631
SMILES:
CCOc1cc(=O)n(C)cc1-c1cc(ccc1Oc1ccc(F)cc1F)N(CCc1ccccc1)S(=O)(=O)CC
: