Target
Genome polyprotein [1657-3011]
Ligand
BDBM245926
Substrate
Meas. Tech.
Transient Transfection Assay
EC50
0.471±n/a nM
Citation
 Vandyck, KLast, SJHoupis, INRaboisson, PJ Benzimidazole-imidazole derivatives US Patent  US9433609 Publication Date 9/6/2016 
Target
Name:
Genome polyprotein [1657-3011]
Synonyms:
POLG_HCV77 | Serine protease NS3/RNA-directed RNA polymerase NS5B (NS3-NS5B)
Type:
Enzyme
Mol. Mass.:
147612.63
Organism:
Hepatitis C virus genotype 1a (isolate H77) (HCV)
Description:
aa 1657-3011
Residue:
1355
  
Inhibitor
Name:
BDBM245926
Synonyms:
US9433609, 19
Type:
Small organic molecule
Emp. Form.:
C44H54N8O6
Mol. Mass.:
790.9496
SMILES:
CC[C@@H](C)[C@H](NC(=O)OC)C(=O)N1CCC[C@H]1c1ncc([nH]1)-c1ccc2cc(ccc2c1)-c1ccc2[nH]c(nc2c1)[C@@H]1CCCN1C(=O)[C@@H](NC(=O)OC)[C@H](C)CC
: