Target
Genome polyprotein [1973-2419,Y2165H]
Ligand
BDBM245925
Substrate
Meas. Tech.
Transient Transfection Assay
EC50
0.080±n/a nM
Citation
 Vandyck, KLast, SJHoupis, INRaboisson, PJ Benzimidazole-imidazole derivatives US Patent  US9433609 Publication Date 9/6/2016 
Target
Name:
Genome polyprotein [1973-2419,Y2165H]
Synonyms:
Non-structural protein 5A (NS5A)(Y93H) Serine protease NS5A (Y93H)
Type:
Enzyme
Mol. Mass.:
48680.14
Organism:
Hepatitis C virus genotype 1b (isolate Con1) (HCV)
Description:
aa 1973-2419
Residue:
447
  
Inhibitor
Name:
BDBM245925
Synonyms:
US9433609, 18
Type:
Small organic molecule
Emp. Form.:
C43H52N8O7
Mol. Mass.:
792.9224
SMILES:
CC[C@H](C)[C@H](NC(=O)OC)C(=O)N1CCC[C@H]1c1nc2cc(ccc2[nH]1)-c1ccc2cc(ccc2c1)-c1cnc([nH]1)[C@@H]1CCCN1C(=O)[C@@H](NC(=O)OC)[C@@H](C)OC
: