Target
Inhibitor of nuclear factor kappa-B kinase subunit epsilon
Ligand
BDBM246029
Substrate
Meas. Tech.
Time-Resolved Fluorescence-based Lanthascreen Assay
pH
7.5±n/a
IC50
<15±n/a nM
Comments
extracted
Citation
 Newton, GKStewart, MRPerrior, TRCrosby, SRHopkins, ANegoita-Giras, GJenkins, K Pyrimidine compounds useful in the treatment of diseases mediated by IKKE and/or TBK1 mechanisms US Patent  US9433622 Publication Date 9/6/2016 
Target
Name:
Inhibitor of nuclear factor kappa-B kinase subunit epsilon
Synonyms:
I kappa-B kinase epsilon I-kappa-B kinase epsilon (IKK-E) IKBKE IKK-epsilon IKKE IKKI KIAA0151 | von Hippel-Lindau disease tumor suppressor/Inhibitor of nuclear factor kappa-B kinase subunit epsilon
Type:
Serine/threonine-protein kinase
Mol. Mass.:
80475.98
Organism:
Homo sapiens (Human)
Description:
Kinase inhibitory activity was determined using recombinant human IKK-epsilon expressed in baculovirus as a FLAG-tagged fusion protein.
Residue:
716
  
Inhibitor
Name:
BDBM246029
Synonyms:
US9433622, DMX- 126
Type:
Small organic molecule
Emp. Form.:
C22H20FN7
Mol. Mass.:
401.4395
SMILES:
F[C@H]1CCN(C1)c1ncc(cc1C#N)-c1ccnc(Nc2ccc3CNCc3c2)n1
: