Target
Serine/threonine-protein kinase TBK1
Ligand
BDBM245958
Substrate
Meas. Tech.
Time-Resolved Fluorescence-based Lanthascreen Assay
pH
7.5±n/a
IC50
<15±n/a nM
Comments
extracted
Citation
 Newton, GKStewart, MRPerrior, TRCrosby, SRHopkins, ANegoita-Giras, GJenkins, K Pyrimidine compounds useful in the treatment of diseases mediated by IKKE and/or TBK1 mechanisms US Patent  US9433622 Publication Date 9/6/2016 
Target
Name:
Serine/threonine-protein kinase TBK1
Synonyms:
NAK Protein cereblon/Serine/threonine-protein kinase TBK1 TANK-binding kinase 1 (TBK-1) TBK1 | TBK1_HUMAN
Type:
protein
Mol. Mass.:
83645.20
Organism:
Homo sapiens (Human)
Description:
Q9UHD2
Residue:
729
  
Inhibitor
Name:
BDBM245958
Synonyms:
US9433622, DMX- 30
Type:
Small organic molecule
Emp. Form.:
C25H26FN7O
Mol. Mass.:
459.5186
SMILES:
F[C@H]1CCN(C1)c1ncc(cc1C#N)-c1ccnc(Nc2ccc(CN3CCOCC3)cc2)n1
: