Target
5-hydroxytryptamine receptor 2A
Ligand
BDBM246304
Substrate
Meas. Tech.
[125I]DOI Radioligand Binding Assay.
pH
7.4±n/a
Temperature
298.15±n/a K
IC50
11±n/a nM
Comments
extracted
Citation
 Xiong, YCherrier, MCChoi, JSDosa, PISmith, BMStrah-Pleynet, SUllman, BTeegarden, B Pyrazole derivatives as modulators of the 5-HT2A serotonin receptor useful for the treatment of disorders related thereto US Patent  US9434692 Publication Date 9/6/2016 
Target
Name:
5-hydroxytryptamine receptor 2A
Synonyms:
5-HT-2 5-HT2A 5-hydroxytryptamine receptor 2A (5HT-2A) 5HT2A_HUMAN HTR2A | Serotonin receptor 2A
Type:
undefined
Mol. Mass.:
52607.65
Organism:
Homo sapiens (Human)
Description:
P28223
Residue:
471
  
Inhibitor
Name:
BDBM246304
Synonyms:
US9434692, 42
Type:
Small organic molecule
Emp. Form.:
C17H18F2N4O2
Mol. Mass.:
348.3472
SMILES:
Cc1[nH]nc(C(=O)N2CCN(CC(=O)c3ccc(F)cc3)CC2)c1F
: