Target
Dual specificity tyrosine-phosphorylation-regulated kinase 1A
Ligand
BDBM246367
Substrate
Meas. Tech.
HotSpot Technology Assay
pH
7.5±n/a
Temperature
298.15±n/a K
IC50
500±n/a nM
Comments
extracted
Citation
 Leblond, BCasagrande, ADesire, LFoucourt, ABesson, T DYRK1 inhibitors and uses thereof US Patent  US9446044 Publication Date 9/20/2016 
Target
Name:
Dual specificity tyrosine-phosphorylation-regulated kinase 1A
Synonyms:
DYR1A_HUMAN DYRK1A Dual specificity YAK1-related kinase 1A (Dyrk1A) Dual-specificity tyrosine-phosphorylation regulated kinase 1A HP86 MNBH
Type:
Enzyme
Mol. Mass.:
85616.61
Organism:
Homo sapiens (Human)
Description:
Q13627
Residue:
763
  
Inhibitor
Name:
BDBM246367
Synonyms:
US9446044, 39
Type:
Small organic molecule
Emp. Form.:
C17H11N5O3S
Mol. Mass.:
365.366
SMILES:
NC(=O)c1nc2ccc3ncnc(Nc4ccc5OCOc5c4)c3c2s1
: