Target
Dual specificity tyrosine-phosphorylation-regulated kinase 1A
Ligand
BDBM246389
Substrate
Meas. Tech.
HotSpot Technology Assay
pH
7.5±n/a
Temperature
298.15±n/a K
IC50
124.7±n/a nM
Comments
extracted
Citation
 Leblond, BCasagrande, ADesire, LFoucourt, ABesson, T DYRK1 inhibitors and uses thereof US Patent  US9446044 Publication Date 9/20/2016 
Target
Name:
Dual specificity tyrosine-phosphorylation-regulated kinase 1A
Synonyms:
DYR1A_HUMAN DYRK1A Dual specificity YAK1-related kinase 1A (Dyrk1A) Dual-specificity tyrosine-phosphorylation regulated kinase 1A HP86 MNBH
Type:
Enzyme
Mol. Mass.:
85616.61
Organism:
Homo sapiens (Human)
Description:
Q13627
Residue:
763
  
Inhibitor
Name:
BDBM246389
Synonyms:
US9446044, 85
Type:
Small organic molecule
Emp. Form.:
C20H16N4O4S
Mol. Mass.:
408.43
SMILES:
CC(C)OC(=O)c1nc2ccc3ncnc(Nc4ccc5OCOc5c4)c3c2s1
: