Target
Tyrosine-protein kinase BTK
Ligand
BDBM246394
Substrate
Meas. Tech.
IMAP-FP Assay
pH
7.2±n/a
IC50
12.04±n/a nM
Comments
extracted
Citation
 Kim, RMLiu, JWu, HLiu, SYang, CZheng, S BTK inhibitors US Patent  US9446130 Publication Date 9/20/2016 
Target
Name:
Tyrosine-protein kinase BTK
Synonyms:
AGMX1 Agammaglobulinaemia tyrosine kinase B cell progenitor kinase BPK BTK_HUMAN Tyrosine Kinase BTK Tyrosine-protein kinase BTK (BTK)
Type:
Enzyme
Mol. Mass.:
76289.95
Organism:
Homo sapiens (Human)
Description:
Q06187
Residue:
659
  
Inhibitor
Name:
BDBM246394
Synonyms:
US9446130, 4
Type:
Small organic molecule
Emp. Form.:
C28H25F3N8O2
Mol. Mass.:
562.5457
SMILES:
CCn1ncc2c1CCCC2(O)c1nc(-c2ccc(cc2)C(=O)Nc2cc(ccn2)C(F)(F)F)c2c(N)nccn12
: