Target
Tyrosine-protein kinase BTK
Ligand
BDBM246395
Substrate
Meas. Tech.
LANCE-TR-FRET Assay
IC50
0.52±n/a nM
Citation
 Kim, RMLiu, JWu, HLiu, SYang, CZheng, S BTK inhibitors US Patent  US9446130 Publication Date 9/20/2016 
Target
Name:
Tyrosine-protein kinase BTK
Synonyms:
AGMX1 Agammaglobulinaemia tyrosine kinase B cell progenitor kinase BPK BTK_HUMAN Tyrosine Kinase BTK Tyrosine-protein kinase BTK (BTK)
Type:
Enzyme
Mol. Mass.:
76289.95
Organism:
Homo sapiens (Human)
Description:
Q06187
Residue:
659
  
Inhibitor
Name:
BDBM246395
Synonyms:
US9446130, 5 | US9718828, Example, 554
Type:
Small organic molecule
Emp. Form.:
C25H20F3N9O
Mol. Mass.:
519.4812
SMILES:
Nc1ncnc2n(nc(-c3ccc(cc3)C(=O)Nc3cc(ccn3)C(F)(F)F)c12)[C@@H]1CCCc2[nH]ncc12
: