Target
Urease
Ligand
BDBM246440
Substrate
Meas. Tech.
Inhibition Assay
pH
6.8±n/a
IC50
24560±20 nM
Comments
extracted
Citation
 Choudhary, MIKhan, AKhan, KMAmbreen, NWahab, ARahman, A Schiff bases of thiazoles: a new class of ureases inhibitors US Patent  US9447057 Publication Date 9/20/2016 
Target
Name:
Urease
Synonyms:
UREA_CANEN | Urea amidohydrolase
Type:
Enzyme
Mol. Mass.:
90746.20
Organism:
Canavalia ensiformis (Jack bean) (Horse bean)
Description:
P07374
Residue:
840
  
Inhibitor
Name:
BDBM246440
Synonyms:
US9447057, 27
Type:
Small organic molecule
Emp. Form.:
C20H20N2O3S
Mol. Mass.:
368.449
SMILES:
COCc1c(\C=N\c2nc(cs2)-c2ccccc2)ccc(OC)c1OC
: