Target
Platelet-derived growth factor receptor beta
Ligand
BDBM6571
Substrate
Poly(E:Y)
Meas. Tech.
Kinase Assay
pH
7.4±n/a
Temperature
298.15±n/a K
IC50
463±n/a nM
Citation
 Kraker, AJHartl, BGAmar, AMBarvian, MRShowalter, HDMoore, CW Biochemical and cellular effects of c-Src kinase-selective pyrido[2,3-d]pyrimidine tyrosine kinase inhibitors. Biochem Pharmacol 60:885-98 (2000)  
Target
Name:
Platelet-derived growth factor receptor beta
Synonyms:
Beta-type platelet-derived growth factor receptor CD140b antigen PDGF Receptor Substrate PDGFR PDGFR-1 PDGFRB PGFRB_HUMAN Platelet-derived growth factor receptor 1 Platelet-derived growth factor receptor beta (PDGFR-beta) Platelet-derived growth factor receptor beta (PDGFRbeta) | VHL/PDGFRB
Type:
Enzyme
Mol. Mass.:
123922.25
Organism:
Homo sapiens (Human)
Description:
P09619
Residue:
1106
  
Inhibitor
Name:
BDBM6571
Synonyms:
N-[2-(4-{[6-(2,6-dichlorophenyl)-8-methyl-7-oxo-7H,8H-pyrido[2,3-d]pyrimidin-2-yl]amino}phenoxy)ethyl]-N-ethylacetamide | PD179483
Type:
Small organic molecule
Emp. Form.:
C26H25Cl2N5O3
Mol. Mass.:
526.414
SMILES:
CCN(CCOc1ccc(Nc2ncc3cc(-c4c(Cl)cccc4Cl)c(=O)n(C)c3n2)cc1)C(C)=O
:
Substrate
Name:
Poly(E:Y)
Synonyms:
Type:
Random polymer
Mol. Mass.:
358.43
Organism:
Description:
Random copolymer of glutamic acid and tyrosine (4:1).
Residue:
3
NA