Target
Urease
Ligand
BDBM246482
Substrate
Meas. Tech.
Urease Inhibition Assay
pH
6.8±0
Temperature
303.15±0 K
IC50
>1.00e+5±n/a nM
Citation
 Adsul, LKBandgar, BPChavan, HVJalde, SSDhakane, VDShirfule, AL Synthesis and biological evaluation of novel series of aminopyrimidine derivatives as urease inhibitors and antimicrobial agents. J Enzyme Inhib Med Chem 28:1316-23 (2013)  
Target
Name:
Urease
Synonyms:
UREA_CANEN | Urea amidohydrolase
Type:
Enzyme
Mol. Mass.:
90746.20
Organism:
Canavalia ensiformis (Jack bean) (Horse bean)
Description:
P07374
Residue:
840
  
Inhibitor
Name:
BDBM246482
Synonyms:
4-(9-Methyl-9H-carbazol-3-yl)-6-(thiophen-2-yl)-pyrimidin-2-amine (5n)
Type:
Small organic molecule
Emp. Form.:
C21H16N4S
Mol. Mass.:
356.444
SMILES:
Cn1c2ccccc2c2cc(ccc12)-c1cc(nc(N)n1)-c1cccs1
: