Target
Replicase polyprotein 1a
Ligand
BDBM50331544
Substrate
BDBM246526
Meas. Tech.
SARS-CoV PLpro Inhibition Assay
pH
8±0
IC50
>1.50e+5±n/a nM
Citation
 Kim, DWSeo, KHCurtis-Long, MJOh, KYOh, JWCho, JKLee, KHPark, KH Phenolic phytochemical displaying SARS-CoV papain-like protease inhibition from the seeds of Psoralea corylifolia. J Enzyme Inhib Med Chem 29:59-63 (2014)  
Target
Name:
Replicase polyprotein 1a
Synonyms:
3C-like proteinase 3CLp Growth factor-like peptide Non-structural protein 1 Non-structural protein 11 Non-structural protein 3 Non-structural protein 6 Non-structural protein 8 ORF1a polyprotein PL2-PRO Papain-like proteinase Replicase polyprotein 1a SARS coronavirus 3C-like proteinase nsp1 nsp11 nsp3 nsp5 nsp7 nsp9 pp1a
Type:
Enzyme
Mol. Mass.:
486353.36
Organism:
Human SARS coronavirus (SARS-CoV)
Description:
P0C6U8
Residue:
4382
  
Inhibitor
Name:
BDBM50331544
Synonyms:
7H-furo[3,2-g]chromen-7-one Furo[3,2-g]chromen-7-one | psoralen
Type:
Small organic molecule
Emp. Form.:
C11H6O3
Mol. Mass.:
186.1635
SMILES:
O=c1ccc2cc3ccoc3cc2o1
:
Substrate
Name:
BDBM246526
Synonyms:
Z-Arg-Leu-Arg-Gly-Gly-7-amido-4-methylcoumarin | Z-RLRGG-AMC
Type:
Peptide
Emp. Form.:
C40H56N12O9
Mol. Mass.:
848.9476
SMILES:
CC(C)C[C@H](NC(=O)[C@H](CCCNC(N)=N)NC(=O)OCc1ccccc1)C(=O)N[C@@H](CCCNC(N)=N)C(=O)NCC(=O)NCC(=O)Nc1ccc2c(C)cc(=O)oc2c1
: