Target
Carbonic anhydrase 1
Ligand
BDBM246532
Substrate
Meas. Tech.
In Vitro Inhibition Assay
IC50
63030±n/a nM
Citation
 Sonmez, FBilen, CSumersan, SGencer, NIsik, SArslan, OKucukislamoglu, M In vitro inhibition effect and structure-activity relationships of some saccharin derivatives on erythrocyte carbonic anhydrase I and II. J Enzyme Inhib Med Chem 29:118-23 (2014)  
Target
Name:
Carbonic anhydrase 1
Synonyms:
CA-I CAB Carbonate dehydratase I Carbonic anhydrase 1 (CA I) Carbonic anhydrase 1 (Recombinant CA I) Carbonic anhydrase B Carbonic anhydrase I (CA I) Carbonic anhydrase I (CAI) Carbonic anhydrase isoenzyme I (hCA I) | hCA
Type:
Enzyme
Mol. Mass.:
28873.37
Organism:
Homo sapiens (Human)
Description:
P00915
Residue:
261
  
Inhibitor
Name:
BDBM246532
Synonyms:
Saccharin derivative, 6f
Type:
Small organic molecule
Emp. Form.:
C14H10ClN3O4S
Mol. Mass.:
351.765
SMILES:
Clc1ccc(NC(=O)Nc2ccc3C(=O)NS(=O)(=O)c3c2)cc1
: