Target
Carbonic anhydrase 2
Ligand
BDBM246549
Substrate
Meas. Tech.
Thermal Shift Assay (TSA)
pH
7±n/a
Kd
6.3±n/a nM
Comments
extracted
Citation
 Zubriene, ACapkauskaite, EGylyte, JKi?onaite, MTumkevicius, SMatulis, D Benzenesulfonamides with benzimidazole moieties as inhibitors of carbonic anhydrases I, II, VII, XII and XIII. J Enzyme Inhib Med Chem 29:124-31 (2014)  
Target
Name:
Carbonic anhydrase 2
Synonyms:
CA-II CAC Carbonate dehydratase II Carbonic anhydrase 2 (CA-II) Carbonic anhydrase C Carbonic anhydrase II (CA-II) Carbonic anhydrase II (hCA II) | Carbonic anhydrase isoenzyme II (hCA II)
Type:
Enzyme
Mol. Mass.:
29250.71
Organism:
Homo sapiens (Human)
Description:
P00918
Residue:
260
  
Inhibitor
Name:
BDBM246549
Synonyms:
4-[(2-Methyl-1H-benzimidazol-1-yl)acetyl]benzenesulfonamide (1b)
Type:
Small organic molecule
Emp. Form.:
C16H15N3O3S
Mol. Mass.:
329.374
SMILES:
Cc1nc2ccccc2n1CC(=O)c1ccc(cc1)S(N)(=O)=O
: