Target
Carbonic anhydrase 2
Ligand
BDBM10882
Substrate
Meas. Tech.
Thermal Shift Assay (TSA)
pH
7±n/a
Kd
0.71±n/a nM
Comments
extracted
Citation
 Zubriene, ACapkauskaite, EGylyte, JKi?onaite, MTumkevicius, SMatulis, D Benzenesulfonamides with benzimidazole moieties as inhibitors of carbonic anhydrases I, II, VII, XII and XIII. J Enzyme Inhib Med Chem 29:124-31 (2014)  
Target
Name:
Carbonic anhydrase 2
Synonyms:
CA-II CAC Carbonate dehydratase II Carbonic anhydrase 2 (CA-II) Carbonic anhydrase C Carbonic anhydrase II (CA-II) Carbonic anhydrase II (hCA II) | Carbonic anhydrase isoenzyme II (hCA II)
Type:
Enzyme
Mol. Mass.:
29250.71
Organism:
Homo sapiens (Human)
Description:
P00918
Residue:
260
  
Inhibitor
Name:
BDBM10882
Synonyms:
6-ethoxy-1,3-benzothiazole-2-sulfonamide Ethamide Ethoxzolamide Ethoxzolamide, EZM US10172837, Ethoxyzolamide | sulfonamide 3
Type:
Small organic molecule
Emp. Form.:
C9H10N2O3S2
Mol. Mass.:
258.317
SMILES:
CCOc1ccc2nc(sc2c1)S(N)(=O)=O
: