Target
Carbonic anhydrase 13
Ligand
BDBM50329822
Substrate
Meas. Tech.
Thermal Shift Assay (TSA)
pH
7±n/a
Kd
1000±n/a nM
Comments
extracted
Citation
 Zubriene, ACapkauskaite, EGylyte, JKi?onaite, MTumkevicius, SMatulis, D Benzenesulfonamides with benzimidazole moieties as inhibitors of carbonic anhydrases I, II, VII, XII and XIII. J Enzyme Inhib Med Chem 29:124-31 (2014)  
Target
Name:
Carbonic anhydrase 13
Synonyms:
CA13 Carbonic anhydrase Carbonic anhydrase XIII (CA XIII)
Type:
Enzyme
Mol. Mass.:
29445.78
Organism:
Homo sapiens (Human)
Description:
Q8N1Q1
Residue:
262
  
Inhibitor
Name:
BDBM50329822
Synonyms:
5-[(2-Benzyl-1H-benzimidazol-1-yl)acetyl]-2-chlorobenzenesulfonamide N-alkylated benzimidazole derivative, 4d | carbonic anhydrase (CA) inhibitors, benzenesulphonamide ligand, 5
Type:
Small organic molecule
Emp. Form.:
C22H18ClN3O3S
Mol. Mass.:
439.915
SMILES:
NS(=O)(=O)c1cc(ccc1Cl)C(=O)Cn1c(Cc2ccccc2)nc2ccccc12
: