Target
Carbonic anhydrase 2
Ligand
BDBM246585
Substrate
Meas. Tech.
Esterase Activity Assay
pH
7.4±n/a
Temperature
298.15±n/a K
Ki
34320±2550 nM
Citation
 Çetinkaya, YGöçer, HGöksu, SGülçin, Ä° Synthesis and carbonic anhydrase isoenzymes I and II inhibitory effects of novel benzylamine derivatives. J Enzyme Inhib Med Chem 29:168-74 (2014)  
Target
Name:
Carbonic anhydrase 2
Synonyms:
CA-II CAC Carbonate dehydratase II Carbonic anhydrase 2 (CA-II) Carbonic anhydrase C Carbonic anhydrase II (CA-II) Carbonic anhydrase II (hCA II) | Carbonic anhydrase isoenzyme II (hCA II)
Type:
Enzyme
Mol. Mass.:
29250.71
Organism:
Homo sapiens (Human)
Description:
P00918
Residue:
260
  
Inhibitor
Name:
BDBM246585
Synonyms:
(2,4-Dimethoxyphenyl)(3,4-dimethoxyphenyl)methanamine hydrochloride (23)
Type:
Small organic molecule
Emp. Form.:
C17H21NO4
Mol. Mass.:
303.3529
SMILES:
COc1ccc(C(N)c2ccc(OC)c(OC)c2)c(OC)c1
: