Target
Tyrosine-protein kinase JAK2
Ligand
BDBM230084
Substrate
Meas. Tech.
Jak2 Tyrosine Kinase Assay
pH
7.4±n/a
Temperature
298.15±n/a K
IC50
>2000±n/a nM
Comments
extracted
Citation
 Batt, DGBertrand, MBDelucca, GVGalella, MAKo, SSLangevine, CMLiu, QShi, QSrivastava, ASTino, JAWatterson, SH Substituted tetrahydrocarbazole and carbazole carboxamide compounds US Patent  US10106559 Publication Date 10/23/2018 
Target
Name:
Tyrosine-protein kinase JAK2
Synonyms:
JAK-2 JAK2_HUMAN Janus kinase 2 (JAK2) | Janus kinase 2 (a protein tyrosine kinase)
Type:
Protein
Mol. Mass.:
130684.68
Organism:
Homo sapiens (Human)
Description:
O60674
Residue:
1132
  
Inhibitor
Name:
BDBM230084
Synonyms:
US10106559, Example 6 US9334290, 5 | US9850258, Example 6
Type:
Small organic molecule
Emp. Form.:
C33H29ClN4O5
Mol. Mass.:
597.06
SMILES:
COc1ccc2c(c1)n(C)c(=O)n(-c1cccc(c1C)-c1c(Cl)cc(C(N)=O)c3[nH]c4cc(ccc4c13)C(C)(C)O)c2=O
: