Target
Tyrosine-protein kinase JAK2
Ligand
BDBM230086
Substrate
Meas. Tech.
Jak2 Tyrosine Kinase Assay
pH
7.4±n/a
Temperature
298.15±n/a K
IC50
>2000±n/a nM
Comments
extracted
Citation
 Batt, DGBertrand, MBDelucca, GVGalella, MAKo, SSLangevine, CMLiu, QShi, QSrivastava, ASTino, JAWatterson, SH Substituted tetrahydrocarbazole and carbazole carboxamide compounds US Patent  US10106559 Publication Date 10/23/2018 
Target
Name:
Tyrosine-protein kinase JAK2
Synonyms:
JAK-2 JAK2_HUMAN Janus kinase 2 (JAK2) | Janus kinase 2 (a protein tyrosine kinase)
Type:
Protein
Mol. Mass.:
130684.68
Organism:
Homo sapiens (Human)
Description:
O60674
Residue:
1132
  
Inhibitor
Name:
BDBM230086
Synonyms:
US10106559, Example 8 US9334290, 8 | US9850258, Example 8
Type:
Small organic molecule
Emp. Form.:
C32H26ClFN4O4
Mol. Mass.:
585.025
SMILES:
Cc1c(cccc1-n1c(=O)n(C)c2ccc(F)cc2c1=O)-c1c(Cl)cc(C(N)=O)c2[nH]c3cc(ccc3c12)C(C)(C)O
: