Target
Tyrosine-protein kinase BTK
Ligand
BDBM230110
Substrate
Meas. Tech.
Human Recombinant Btk Enzyme Assay
pH
7.4±n/a
Temperature
298.15±n/a K
IC50
0.910±n/a nM
Comments
extracted
Citation
 Batt, DGBertrand, MBDelucca, GVGalella, MAKo, SSLangevine, CMLiu, QShi, QSrivastava, ASTino, JAWatterson, SH Substituted tetrahydrocarbazole and carbazole carboxamide compounds US Patent  US10106559 Publication Date 10/23/2018 
Target
Name:
Tyrosine-protein kinase BTK
Synonyms:
AGMX1 Agammaglobulinaemia tyrosine kinase B cell progenitor kinase BPK BTK_HUMAN Tyrosine Kinase BTK Tyrosine-protein kinase BTK (BTK)
Type:
Enzyme
Mol. Mass.:
76289.95
Organism:
Homo sapiens (Human)
Description:
Q06187
Residue:
659
  
Inhibitor
Name:
BDBM230110
Synonyms:
US10106559, Example 37 US9334290, 37 | US9850258, Example 37
Type:
Small organic molecule
Emp. Form.:
C32H27ClN4O5
Mol. Mass.:
583.034
SMILES:
COc1cccn2c1cc(=O)n(-c1cccc(c1C)-c1c(Cl)cc(C(N)=O)c3[nH]c4cc(ccc4c13)C(C)(C)O)c2=O
: