Target
Tyrosine-protein kinase BTK
Ligand
BDBM230132
Substrate
Meas. Tech.
Human Recombinant Btk Enzyme Assay
pH
7.4±n/a
Temperature
298.15±n/a K
IC50
0.450±n/a nM
Comments
extracted
Citation
 Batt, DGBertrand, MBDelucca, GVGalella, MAKo, SSLangevine, CMLiu, QShi, QSrivastava, ASTino, JAWatterson, SH Substituted tetrahydrocarbazole and carbazole carboxamide compounds US Patent  US10106559 Publication Date 10/23/2018 
Target
Name:
Tyrosine-protein kinase BTK
Synonyms:
AGMX1 Agammaglobulinaemia tyrosine kinase B cell progenitor kinase BPK BTK_HUMAN Tyrosine Kinase BTK Tyrosine-protein kinase BTK (BTK)
Type:
Enzyme
Mol. Mass.:
76289.95
Organism:
Homo sapiens (Human)
Description:
Q06187
Residue:
659
  
Inhibitor
Name:
BDBM230132
Synonyms:
US10106559, Example 63 US9334290, 63 | US9850258, Example 63
Type:
Small organic molecule
Emp. Form.:
C31H28ClFN4O4
Mol. Mass.:
575.03
SMILES:
Cc1c(cccc1-n1c(=O)[nH]c2c(Cl)cccc2c1=O)-c1c(F)cc(C(N)=O)c2[nH]c3C[C@H](CCc3c12)C(C)(C)O
: