Target
Tyrosine-protein kinase BTK
Ligand
BDBM230094
Substrate
Meas. Tech.
Human Recombinant Btk Enzyme Assay
pH
7.4±n/a
Temperature
298.15±n/a K
IC50
0.790±n/a nM
Comments
extracted
Citation
 Batt, DGBertrand, MBDelucca, GVGalella, MAKo, SSLangevine, CMLiu, QShi, QSrivastava, ASTino, JAWatterson, SH Substituted tetrahydrocarbazole and carbazole carboxamide compounds US Patent  US10106559 Publication Date 10/23/2018 
Target
Name:
Tyrosine-protein kinase BTK
Synonyms:
AGMX1 Agammaglobulinaemia tyrosine kinase B cell progenitor kinase BPK BTK_HUMAN Tyrosine Kinase BTK Tyrosine-protein kinase BTK (BTK)
Type:
Enzyme
Mol. Mass.:
76289.95
Organism:
Homo sapiens (Human)
Description:
Q06187
Residue:
659
  
Inhibitor
Name:
BDBM230094
Synonyms:
US10106559, Example 74 US9334290, 17 US9850258, Example 74
Type:
Small organic molecule
Emp. Form.:
C32H26F2N4O4
Mol. Mass.:
568.57
SMILES:
Cc1c(cccc1-n1c(=O)n(C)c2c(F)cccc2c1=O)-c1c(F)cc(C(N)=O)c2[nH]c3cc(ccc3c12)C(C)(C)O
: