Target
Isocitrate dehydrogenase [NADP] cytoplasmic
Ligand
BDBM247869
Substrate
Meas. Tech.
Fluorescence Biochemical Assay
pH
7.5±n/a
Temperature
298.15±n/a K
IC50
12±n/a nM
Comments
extracted
Citation
 Caferro, TRChen, ZCho, YSCostales, AQLevell, JRLiu, GManning, JRSendzik, MShafer, CShultz, MDSutton, JWang, YZhao, Q 3-pyrimidin-4-yl-oxazolidin-2-ones as inhibitors of mutant IDH US Patent  US9434719 Publication Date 9/6/2016 
Target
Name:
Isocitrate dehydrogenase [NADP] cytoplasmic
Synonyms:
Cytosolic NADP-isocitrate dehydrogenase IDH1 IDP Isocitrate dehydrogenase 1 (IDH1) Oxalosuccinate decarboxylase | PICD
Type:
Protein
Mol. Mass.:
46661.29
Organism:
Homo sapiens (Human)
Description:
O75874
Residue:
414
  
Inhibitor
Name:
BDBM247869
Synonyms:
US10112931, Example 476 US9688672, Example 476
Type:
Small organic molecule
Emp. Form.:
C20H19ClF2N6O2
Mol. Mass.:
448.854
SMILES:
C[C@H](F)[C@H]1COC(=O)N1c1ccnc(N[C@@H](C)c2cn(cn2)-c2ccc(Cl)cc2F)n1
: