Target
Cytochrome P450 3A4
Ligand
BDBM247971
Substrate
US9434724, Midazolam
Meas. Tech.
Cytochrome P450 Inhibition
Temperature
310.15±n/a K
IC50
>10000±n/a nM
Comments
extracted
Citation
 Bilcer, GMNg, R Quinuclidines for modulating alpha 7 activity US Patent  US9434724 Publication Date 9/6/2016 
Target
Name:
Cytochrome P450 3A4
Synonyms:
Albendazole monooxygenase CP3A4_HUMAN CYP3A4 CYPIIIA4 Cytochrome P450 3A4 (CYP3A4) Nifedipine oxidase Taurochenodeoxycholate 6-alpha-hydroxylase
Type:
Enzyme
Mol. Mass.:
57349.57
Organism:
Homo sapiens (Human)
Description:
Residue:
503
  
Inhibitor
Name:
BDBM247971
Synonyms:
US9434724, 53
Type:
Small organic molecule
Emp. Form.:
C17H19BrN2O3
Mol. Mass.:
379.248
SMILES:
Oc1cc(Br)c2c(c[nH]c2c1)C(=O)OCC12CCN(CC1)CC2
:
Substrate
Name:
BDBM21363
Synonyms:
12-chloro-9-(2-fluorophenyl)-3-methyl-2,4,8-triazatricyclo[8.4.0.0^{2,6}]tetradeca-1(10),3,5,8,11,13-hexaene CHEMBL655 Midazolam US20230416258, Compound Midazolam
Type:
Small organic molecule
Emp. Form.:
C18H13ClFN3
Mol. Mass.:
325.767
SMILES:
Cc1ncc2CN=C(c3ccccc3F)c3cc(Cl)ccc3-n12
: