Target
High affinity cGMP-specific 3',5'-cyclic phosphodiesterase 9A
Ligand
BDBM247237
Substrate
Meas. Tech.
Inhibition Assay
Temperature
298.15±n/a K
IC50
120±n/a nM
Comments
extracted
Citation
 Svenstrup, NSimonsen, KBRasmussen, LKJuhl, KLanggård, MWen, KWang, Y PDE9 inhibitors with imidazo triazinone backbone US Patent  US9434733 Publication Date 9/6/2016 
Target
Name:
High affinity cGMP-specific 3',5'-cyclic phosphodiesterase 9A
Synonyms:
3',5'-cyclic phosphodiesterase PDE9A_HUMAN Phosphodiesterase 9A (PDE9) | Phosphodiesterase 9A (PDE9A)
Type:
Protein
Mol. Mass.:
68488.40
Organism:
Homo sapiens (Human)
Description:
O76083
Residue:
593
  
Inhibitor
Name:
BDBM247237
Synonyms:
US9434733, 2-[[3-(5-pyrrolidin-1-ylpyrimidin-2-yl)azetidin-1-yl]methyl]-7-tetrahydropyran-4-yl-3H-imidazo[5,1-f][1,2,4]triazin-4-one | US9533992, 2-[[3-(5-pyrrolidin-1-ylpyrimidin-2-yl)azetidin-1-yl]methyl]-7-tetrahydropyran-4-yl-3H-imidazo[5,1-f][1,2,4]triazin-4-one
Type:
Small organic molecule
Emp. Form.:
C22H28N8O2
Mol. Mass.:
436.5101
SMILES:
O=c1[nH]c(CN2CC(C2)c2ncc(cn2)N2CCCC2)nn2c(ncc12)C1CCOCC1
: