Target
Cytochrome P450 2D6
Ligand
BDBM247261
Substrate
Meas. Tech.
Inhibition Assay
Temperature
310.15±n/a K
IC50
>40000±n/a nM
Comments
extracted
Citation
 Pevarello, P Fluorinated arylalkylaminocarboxamide derivatives US Patent  US9447029 Publication Date 9/20/2016 
Target
Name:
Cytochrome P450 2D6
Synonyms:
CP2D6_HUMAN CYP2DL1 Cytochrome P450 2D6 (CYP2D6) P450-DB1
Type:
Protein
Mol. Mass.:
55774.82
Organism:
Homo sapiens (Human)
Description:
P10635
Residue:
497
  
Inhibitor
Name:
BDBM247261
Synonyms:
US9447029, 2-1
Type:
Small organic molecule
Emp. Form.:
C17H26F2N2O2
Mol. Mass.:
328.3973
SMILES:
CCCCOc1cccc(c1)C(F)(F)CNC(C)C(=O)N(C)C
: