Target
Platelet-derived growth factor receptor beta
Ligand
BDBM6573
Substrate
VEGF-receptor 2 and PDGF-receptor beta (KDR and PDGFR beta)
Meas. Tech.
Receptor Autophosphorylation Inhibition Assay
pH
7.4±n/a
Temperature
295.15±n/a K
IC50
300±n/a nM
Citation
 Mahboobi, STeller, SPongratz, HHufsky, HSellmer, ABotzki, AUecker, ABeckers, TBaasner, SSchachtele, CUberall, FKassack, MUDove, SBohmer, FD Bis(1H-2-indolyl)methanones as a novel class of inhibitors of the platelet-derived growth factor receptor kinase. J Med Chem 45:1002-18 (2002)  
Target
Name:
Platelet-derived growth factor receptor beta
Synonyms:
Beta-type platelet-derived growth factor receptor CD140b antigen PDGF Receptor Substrate PDGFR PDGFR-1 PDGFRB PGFRB_HUMAN Platelet-derived growth factor receptor 1 Platelet-derived growth factor receptor beta (PDGFR-beta) Platelet-derived growth factor receptor beta (PDGFRbeta) | VHL/PDGFRB
Type:
Enzyme
Mol. Mass.:
123922.25
Organism:
Homo sapiens (Human)
Description:
P09619
Residue:
1106
  
Inhibitor
Name:
BDBM6573
Synonyms:
(5-Methoxy-1H-2-indolyl)(1H-2-indolyl)methanone Bis(1H-2-indolyl)methanone 11 | CHEMBL7296
Type:
Small organic molecule
Emp. Form.:
C18H14N2O2
Mol. Mass.:
290.316
SMILES:
COc1ccc2[nH]c(cc2c1)C(=O)c1cc2ccccc2[nH]1
:
Substrate
Name:
Platelet-derived growth factor receptor beta
Synonyms:
Beta-type platelet-derived growth factor receptor CD140b antigen PDGF Receptor Substrate PDGFR PDGFR-1 PDGFRB PGFRB_HUMAN Platelet-derived growth factor receptor 1 Platelet-derived growth factor receptor beta (PDGFR-beta) Platelet-derived growth factor receptor beta (PDGFRbeta) | VHL/PDGFRB
Type:
Enzyme
Mol. Mass.:
123922.25
Organism:
Homo sapiens (Human)
Description:
P09619
Residue:
1106