Target
Beta-secretase 2
Ligand
BDBM247278
Substrate
Meas. Tech.
Time-Resolved Endpoint Proteolysis Assay
pH
5±n/a
Temperature
303.15±n/a K
Ki
2±n/a nM
Comments
extracted
Citation
 Cumming, JNScott, JDBiftu, T Iminothiadiazine dioxides containing a thioamide, amidine, or amide oxime group as BACE inhibitors, compositions, and their use US Patent  US9447085 Publication Date 9/20/2016 
Target
Name:
Beta-secretase 2
Synonyms:
AEPLC ASP1 Asp 1 Aspartyl protease 1 BACE2_HUMAN Beta-secretase (BACE) Beta-secretase 2 (BACE-2) Beta-site APP-cleaving enzyme 2 Memapsin-1 beta-Secretase (BACE-2)
Type:
Protein
Mol. Mass.:
56171.20
Organism:
Homo sapiens (Human)
Description:
Q9Y5Z0
Residue:
518
  
Inhibitor
Name:
BDBM247278
Synonyms:
US9447085, 3
Type:
Small organic molecule
Emp. Form.:
C14H19FN4O3S2
Mol. Mass.:
374.454
SMILES:
COCC(=S)Nc1ccc(F)c(c1)[C@]1(C)CS(=O)(=O)N(C)C(=N)N1
: