Target
Beta-secretase 2
Ligand
BDBM247279
Substrate
Meas. Tech.
Time-Resolved Endpoint Proteolysis Assay
pH
5±n/a
Temperature
303.15±n/a K
Ki
7±n/a nM
Comments
extracted
Citation
 Cumming, JNScott, JDBiftu, T Iminothiadiazine dioxides containing a thioamide, amidine, or amide oxime group as BACE inhibitors, compositions, and their use US Patent  US9447085 Publication Date 9/20/2016 
Target
Name:
Beta-secretase 2
Synonyms:
AEPLC ASP1 Asp 1 Aspartyl protease 1 BACE2_HUMAN Beta-secretase (BACE) Beta-secretase 2 (BACE-2) Beta-site APP-cleaving enzyme 2 Memapsin-1 beta-Secretase (BACE-2)
Type:
Protein
Mol. Mass.:
56171.20
Organism:
Homo sapiens (Human)
Description:
Q9Y5Z0
Residue:
518
  
Inhibitor
Name:
BDBM247279
Synonyms:
US9447085, 4
Type:
Small organic molecule
Emp. Form.:
C13H15F3N4O2S2
Mol. Mass.:
380.409
SMILES:
CN1C(=N)N[C@@](C)(CS1(=O)=O)c1cc(NC(=S)C(F)F)ccc1F
: