Target
Guanylate cyclase soluble subunit alpha-1/beta-1
Ligand
BDBM247294
Substrate
Meas. Tech.
Activation Assay
Temperature
298.15±n/a K
EC50
2800±n/a nM
Comments
extracted
Citation
 Koga, YMaeno, KSato, IImamura, YHanazawa, TIida, MOhne, KImamura, KWatanabe, TNozawa, EShibata, H Imidazopyridine compounds US Patent  US9447090 Publication Date 9/20/2016 
Target
Name:
Guanylate cyclase soluble subunit alpha-1/beta-1
Synonyms:
Soluble Guanylate Cyclases Soluble guanylate cyclase alpha 1 and beta 1 subunits (sGC) soluble guanylate cyclase activators | soluble guanylate cyclase apha 1 and soluble guanylate cyclase beta 1
Type:
Enzyme
Mol. Mass.:
Description:
Components:
This complex has 2 components.
Component 1
Name:
Guanylate cyclase soluble subunit alpha-1
Synonyms:
GCS-alpha-1 GCYA1_HUMAN GUCSA3 GUCY1A3 Guanylate cyclase soluble subunit alpha-3 Solube guanylate cyclase alpha-1 (sGCalpha) | soluble guanylate cyclase alpha-1 (sGC)
Type:
Enzyme
Mol. Mass.:
77457.21
Organism:
Homo sapiens (Human)
Description:
Q02108
Residue:
690
  
Component 2
Name:
Guanylate cyclase soluble subunit beta-1
Synonyms:
GCYB1_HUMAN GUCSB3 GUCY1B3 Solube guanylate cyclase beta-1 (sGCβ1) | soluble guanylate cyclase beta-1 (sGC)
Type:
Enzyme
Mol. Mass.:
70496.05
Organism:
Homo sapiens (Human)
Description:
Q02153
Residue:
619
  
Inhibitor
Name:
BDBM247294
Synonyms:
US9447090, 102
Type:
Small organic molecule
Emp. Form.:
C24H29N3O3
Mol. Mass.:
407.5054
SMILES:
Cc1nc2c(OCC3CCCCC3)cccn2c1C(=O)N[C@@H](CO)c1ccccc1
: