Target
Fibroblast growth factor receptor 1
Ligand
BDBM247346
Substrate
Meas. Tech.
TR-FRET Assay
IC50
98±n/a nM
Citation
 Linnanen, TWohlfahrt, GNanduri, SUjjinamatada, RRajagopalan, SMukherjee, S Protein kinase inhibitors US Patent  US9447091 Publication Date 9/20/2016 
Target
Name:
Fibroblast growth factor receptor 1
Synonyms:
BFGFR Basic fibroblast growth factor receptor 1 (FGFR1) CEK FGFR-1 FGFR-1, (FL) FGFR1_HUMAN FLT2 Fibroblast growth factor receptor 1 (FGFR-1) Fms-like tyrosine kinase 2 N-sam bFGF-R | c-fgr
Type:
Receptor
Mol. Mass.:
91861.70
Organism:
Homo sapiens (Human)
Description:
P11362
Residue:
822
  
Inhibitor
Name:
BDBM247346
Synonyms:
US9447091, 134
Type:
Small organic molecule
Emp. Form.:
C28H20F2N6O2S
Mol. Mass.:
542.559
SMILES:
Cn1cc(cn1)-c1cnc2n(cnc2c1)-c1cc(NS(=O)(=O)c2ccccc2)cc(c1)-c1ccc(F)cc1F
: