Target
Fibroblast growth factor receptor 1
Ligand
BDBM247349
Substrate
Meas. Tech.
TR-FRET Assay
IC50
62±n/a nM
Citation
 Linnanen, TWohlfahrt, GNanduri, SUjjinamatada, RRajagopalan, SMukherjee, S Protein kinase inhibitors US Patent  US9447091 Publication Date 9/20/2016 
Target
Name:
Fibroblast growth factor receptor 1
Synonyms:
BFGFR Basic fibroblast growth factor receptor 1 (FGFR1) CEK FGFR-1 FGFR-1, (FL) FGFR1_HUMAN FLT2 Fibroblast growth factor receptor 1 (FGFR-1) Fms-like tyrosine kinase 2 N-sam bFGF-R | c-fgr
Type:
Receptor
Mol. Mass.:
91861.70
Organism:
Homo sapiens (Human)
Description:
P11362
Residue:
822
  
Inhibitor
Name:
BDBM247349
Synonyms:
US9447091, 155
Type:
Small organic molecule
Emp. Form.:
C21H18N8O
Mol. Mass.:
398.4206
SMILES:
CC(=O)Nc1cc(cc(c1)-n1cnc2cc(ccc12)-c1cnn(C)c1)-n1cncn1
: