Target
Fibroblast growth factor receptor 1
Ligand
BDBM247365
Substrate
Meas. Tech.
TR-FRET Assay
IC50
65.8±n/a nM
Citation
 Linnanen, TWohlfahrt, GNanduri, SUjjinamatada, RRajagopalan, SMukherjee, S Protein kinase inhibitors US Patent  US9447091 Publication Date 9/20/2016 
Target
Name:
Fibroblast growth factor receptor 1
Synonyms:
BFGFR Basic fibroblast growth factor receptor 1 (FGFR1) CEK FGFR-1 FGFR-1, (FL) FGFR1_HUMAN FLT2 Fibroblast growth factor receptor 1 (FGFR-1) Fms-like tyrosine kinase 2 N-sam bFGF-R | c-fgr
Type:
Receptor
Mol. Mass.:
91861.70
Organism:
Homo sapiens (Human)
Description:
P11362
Residue:
822
  
Inhibitor
Name:
BDBM247365
Synonyms:
US9447091, 322
Type:
Small organic molecule
Emp. Form.:
C26H26F2N4O3S
Mol. Mass.:
512.571
SMILES:
OC1CCN(C1)c1ccc2n(cnc2c1)-c1cc(NS(=O)(=O)C2CC2)cc(c1)C1=CC=C(F)CC1F
: