Target
Receptor-type tyrosine-protein kinase FLT3 [R834Q]
Ligand
BDBM247371
Substrate
Meas. Tech.
KINOMEScan Technology Assays
Kd
110±n/a nM
Citation
 Blagg, JBavetsias, VMoore, ASLinardopoulos, S Pharmaceutically active compounds US Patent  US9447092 Publication Date 9/20/2016 
Target
Name:
Receptor-type tyrosine-protein kinase FLT3 [R834Q]
Synonyms:
CD135 FLT3 Receptor-type tyrosine-protein kinase FLT3 (R834Q) | STK1
Type:
Enzyme
Mol. Mass.:
112859.55
Organism:
Homo sapiens (Human)
Description:
R834Q
Residue:
993
  
Inhibitor
Name:
BDBM247371
Synonyms:
US9447092, 1
Type:
Small organic molecule
Emp. Form.:
C22H23Cl2N7
Mol. Mass.:
456.371
SMILES:
Cc1nn(C)cc1-c1nc2c(N3CCN(Cc4ccc(Cl)cc4)CC3)c(Cl)cnc2[nH]1
: