Target
Cytochrome P450 2C19
Ligand
BDBM247368
Substrate
Meas. Tech.
Inhibition Assays
IC50
30±n/a nM
Citation
 Blagg, JBavetsias, VMoore, ASLinardopoulos, S Pharmaceutically active compounds US Patent  US9447092 Publication Date 9/20/2016 
Target
Name:
Cytochrome P450 2C19
Synonyms:
(R)-limonene 6-monooxygenase (S)-limonene 7-monooxygenase CYP2C19 CYPIIC19 Cytochrome P450 2C19 [I331V] Cytochrome P450-254C Mephenytoin 4-hydroxylase P450-254C
Type:
Enzyme
Mol. Mass.:
55935.47
Organism:
Homo sapiens (Human)
Description:
P33261
Residue:
490
  
Inhibitor
Name:
BDBM247368
Synonyms:
US9447092, Comparator 2, Example 57
Type:
Small organic molecule
Emp. Form.:
C22H25BrN8
Mol. Mass.:
481.392
SMILES:
Cc1nn(C)c(C)c1-c1nc2c(N3CCN(Cc4cccnc4)CC3)c(Br)cnc2[nH]1
: