Target
cAMP and cAMP-inhibited cGMP 3',5'-cyclic phosphodiesterase 10A
Ligand
BDBM247398
Substrate
Meas. Tech.
[3H] cAMP SPA Assay
pH
7.5±n/a
IC50
37.0±n/a nM
Comments
extracted
Citation
 Camacho Gómez, JCastro Palomino Laria, J Pyrimidine derivatives as phosphodiesterase 10 inhibitors (PDE-10) US Patent  US9447095 Publication Date 9/20/2016 
Target
Name:
cAMP and cAMP-inhibited cGMP 3',5'-cyclic phosphodiesterase 10A
Synonyms:
3',5'-cyclic phosphodiesterase PDE10_HUMAN Phosphodiesterase 10A
Type:
Protein
Mol. Mass.:
88412.52
Organism:
Homo sapiens (Human)
Description:
Q9Y233
Residue:
779
  
Inhibitor
Name:
BDBM247398
Synonyms:
US9447095, 61
Type:
Small organic molecule
Emp. Form.:
C13H13BrN8
Mol. Mass.:
361.2
SMILES:
CCNc1nc(nc(N)c1Br)-n1cc(cn1)-c1ccncn1
: