Target
Phospholipase D1
Ligand
BDBM247410
Substrate
Meas. Tech.
In Vitro Activity Assay
IC50
15±n/a nM
Citation
 Lindsley, CWBrown, AH Antiviral therapies with phospholipase D inhibitors US Patent  US9453017 Publication Date 9/27/2016 
Target
Name:
Phospholipase D1
Synonyms:
Choline phosphatase 1 PLD1 Phosphatidylcholine-hydrolyzing phospholipase D1 Phospholipase D1 Phospholipase D2 (PLD2) | hPLD1
Type:
Protein
Mol. Mass.:
124219.92
Organism:
Homo sapiens (Human)
Description:
Q13393
Residue:
1074
  
Inhibitor
Name:
BDBM247410
Synonyms:
US9453017, 2
Type:
Small organic molecule
Emp. Form.:
C25H29BrN4O2
Mol. Mass.:
497.427
SMILES:
C[C@@H](CN1CCC(CC1)n1c2ccc(Br)cc2[nH]c1=O)NC(=O)[C@@H]1C[C@@H]1c1ccccc1
: