Target
Coagulation factor XI
Ligand
BDBM247416
Substrate
US9453018, pyroGlu-Pro-Arg-pNA
Meas. Tech.
In Vitro Assay
pH
7.4±n/a
Temperature
310.15±n/a K
Ki
0.1±n/a nM
Citation
 Dilger, AKCorte, JRDe Lucca, IFang, TYang, WWang, YPabbisetty, KBEwing, WRZhu, YWexler, RRPinto, DJOrwat, MJSmith, II, LM Pyrimidinones as factor XIa inhibitors US Patent  US9453018 Publication Date 9/27/2016 
Target
Name:
Coagulation factor XI
Synonyms:
Coagulation factor XIa Coagulation factor XIa light chain FA11_HUMAN Factor XIa PTA | Plasma thromboplastin antecedent
Type:
Enzyme
Mol. Mass.:
70130.58
Organism:
Homo sapiens (Human)
Description:
P03951
Residue:
625
  
Inhibitor
Name:
BDBM247416
Synonyms:
US10336754, Example 369 US9453018, 369
Type:
Small organic molecule
Emp. Form.:
C29H23ClF5N9O2
Mol. Mass.:
659.997
SMILES:
C[C@@H]1CCC[C@@H](c2cc(ccn2)-c2c(NC1=O)cnn2C(F)F)n1cnc(cc1=O)-c1cc(Cl)ccc1-n1cc(nn1)C(F)(F)F
:
Substrate
Name:
BDBM13573
Synonyms:
(2S)-5-carbamimidamido-N-(4-nitrophenyl)-2-{[(2S)-1-{[(2S)-5-oxopyrrolidin-2-yl]carbonyl}pyrrolidin-2-yl]formamido}pentanamide hydrochloride Glu-Pro-Arg-pNA L-Pyroglutamyl-L-prolyl-L-arginine-p-Nitroaniline S-2366
Type:
Small organic molecule
Emp. Form.:
C22H30N8O6
Mol. Mass.:
502.5236
SMILES:
[#7]\[#6](-[#7])=[#7]/[#6]-[#6]-[#6]-[#6@H](-[#7]-[#6](=O)-[#6@@H]-1-[#6]-[#6]-[#6]-[#7]-1-[#6](=O)-[#6@@H]-1-[#6]-[#6]-[#6](=O)-[#7]-1)-[#6](=O)-[#7]-c1ccc(cc1)-[#7+](-[#8-])=O
: