Target
Plasma kallikrein
Ligand
BDBM247417
Substrate
BDBM247420
Meas. Tech.
In Vitro Assay
pH
7.5±n/a
Temperature
310.15±n/a K
Ki
17±n/a nM
Citation
 Dilger, AKCorte, JRDe Lucca, IFang, TYang, WWang, YPabbisetty, KBEwing, WRZhu, YWexler, RRPinto, DJOrwat, MJSmith, II, LM Pyrimidinones as factor XIa inhibitors US Patent  US9453018 Publication Date 9/27/2016 
Target
Name:
Plasma kallikrein
Synonyms:
Fletcher factor KLKB1 Kallikrein Plasma kallikrein heavy chain Plasma prekallikrein
Type:
Protein
Mol. Mass.:
71391.16
Organism:
Homo sapiens (Human)
Description:
P03952
Residue:
638
  
Inhibitor
Name:
BDBM247417
Synonyms:
US10336754, Example 371 US9453018, 370 | US9453018, 371
Type:
Small organic molecule
Emp. Form.:
C29H25ClF3N9O2
Mol. Mass.:
624.016
SMILES:
C[C@@H]1CCC[C@@H](c2ccnc(c2)-c2c(NC1=O)cnn2C)n1cnc(cc1=O)-c1cc(Cl)ccc1-n1cc(nn1)C(F)(F)F
:
Substrate
Name:
BDBM247420
Synonyms:
US9453018, Pro-Phe-Arg-pNA
Type:
Small organic molecule
Emp. Form.:
C26H34N8O5
Mol. Mass.:
538.5988
SMILES:
[#7]\[#6](-[#7])=[#7]/[#6]-[#6]-[#6]-[#6@H](-[#7]-c1ccc(cc1)-[#7+](-[#8-])=O)-[#6](=O)-[#7]-[#6](=O)-[#6@H](-[#6]-c1ccccc1)-[#7]-[#6](=O)-[#6@H]-1-[#6]-[#6]-[#6]-[#7]-1
: