Target
Histamine receptor H3
Ligand
BDBM247451
Substrate
Meas. Tech.
Radioligand Binding Assay
Ki
35.3±n/a nM
Citation
 Gao, Z Substituted phenyl cycloalkyl pyrrolidine (piperidine) spirolactams and amides, preparation and therapeutic use thereof US Patent  US9453023 Publication Date 9/27/2016 
Target
Name:
Histamine receptor H3
Synonyms:
Type:
Enzyme
Mol. Mass.:
48611.84
Organism:
Macaca mulatta (Rhesus macaque)
Description:
Q865E1
Residue:
445
  
Inhibitor
Name:
BDBM247451
Synonyms:
US9453023, 10
Type:
Small organic molecule
Emp. Form.:
C25H36N2O2
Mol. Mass.:
396.5655
SMILES:
C[C@@H]1CCCN1[C@H]1CC[C@@H](CC1)c1ccc(cc1)N1CCC2(CCOCC2)C1=O
: