Target
Histamine receptor H3
Ligand
BDBM247468
Substrate
Meas. Tech.
Radioligand Binding Assay
Ki
34.0±n/a nM
Citation
 Gao, Z Substituted phenyl cycloalkyl pyrrolidine (piperidine) spirolactams and amides, preparation and therapeutic use thereof US Patent  US9453023 Publication Date 9/27/2016 
Target
Name:
Histamine receptor H3
Synonyms:
Type:
Enzyme
Mol. Mass.:
48611.84
Organism:
Macaca mulatta (Rhesus macaque)
Description:
Q865E1
Residue:
445
  
Inhibitor
Name:
BDBM247468
Synonyms:
US9453023, 27
Type:
Small organic molecule
Emp. Form.:
C19H28N2O2S
Mol. Mass.:
348.503
SMILES:
C[C@H]1CCCN1C1CC[C@@H](C1)c1ccc(NS(=O)(=O)C2CC2)cc1
: