Target
Histamine receptor H3
Ligand
BDBM247475
Substrate
Meas. Tech.
Radioligand Binding Assay
Ki
98.7±n/a nM
Citation
 Gao, Z Substituted phenyl cycloalkyl pyrrolidine (piperidine) spirolactams and amides, preparation and therapeutic use thereof US Patent  US9453023 Publication Date 9/27/2016 
Target
Name:
Histamine receptor H3
Synonyms:
Type:
Enzyme
Mol. Mass.:
48611.84
Organism:
Macaca mulatta (Rhesus macaque)
Description:
Q865E1
Residue:
445
  
Inhibitor
Name:
BDBM247475
Synonyms:
US9453023, 34
Type:
Small organic molecule
Emp. Form.:
C24H30N2O
Mol. Mass.:
362.5078
SMILES:
C[C@H]1CCCN1C1CC[C@@H](C1)c1ccc(NC(=O)c2ccc(C)cc2)cc1
: