Target
Casein kinase II subunit alpha/beta
Ligand
BDBM248089
Substrate
BDBM248093
Meas. Tech.
In Vitro Kinase Assay
pH
7.5±0
Temperature
303.15±0 K
IC50
>3.0e+4±n/a nM
Citation
 Chekanov, MOOstrynska, OVSynyugin, ARBdzhola, VGYarmoluk, SM Design, synthesis and evaluation of 2-phenylisothiazolidin-3-one-1,1-dioxides as a new class of human protein kinase CK2 inhibitors. J Enzyme Inhib Med Chem 29:338-43 (2014)  
Target
Name:
Casein kinase II subunit alpha/beta
Synonyms:
Casein kinase 2 (CK2) Casein kinase II subunit alpha alpha beta beta | Complex of catalytic (CK2α) and non-catalytic (CK2β) subunits
Type:
Mol. Mass.:
Description:
ASSAY_ID of ChEMBL is 989485
Components:
This complex has 2 components.
Component 1
Name:
Casein kinase II subunit alpha
Synonyms:
CK II CK2- alpha CSK21_HUMAN Casein kinase 2 Casein kinase II alpha/beta Casein kinase II subunit alpha (CK2A1) Casein kinase II subunit alpha (CK2a V66A) Casein kinase II subunit alpha (CK2a)
Type:
Enzyme
Mol. Mass.:
45151.12
Organism:
Homo sapiens (Human)
Description:
P68400
Residue:
391
  
Component 2
Name:
Casein kinase II subunit beta
Synonyms:
CK II beta Casein kinase II beta Ck2n Phosvitin
Type:
PROTEIN
Mol. Mass.:
24937.13
Organism:
Rattus norvegicus
Description:
EBI_10969
Residue:
215
  
Inhibitor
Name:
BDBM248089
Synonyms:
Methyl 5-{[2-chloro-4-(4-methyl-1,1-dioxido-3-oxoisothiazolidin-2-yl)benzoyl]amino}-2-hydroxybenzoate (39)
Type:
Small organic molecule
Emp. Form.:
C19H17ClN2O7S
Mol. Mass.:
452.865
SMILES:
COC(=O)c1cc(NC(=O)c2ccc(cc2Cl)N2C(=O)C(C)CS2(=O)=O)ccc1O
:
Substrate
Name:
BDBM248093
Synonyms:
RRRDDDSDDD
Type:
Peptide
Emp. Form.:
C45H73N19O24
Mol. Mass.:
1264.174
SMILES:
N[C@@H](CCCNC(N)=N)C(=O)N[C@@H](CCCNC(N)=N)C(=O)N[C@@H](CCCNC(N)=N)C(=O)N[C@@H](CC(O)=O)C(=O)N[C@@H](CC(O)=O)C(=O)N[C@@H](CC(O)=O)C(=O)N[C@@H](CO)C(=O)N[C@@H](CC(O)=O)C(=O)N[C@@H](CC(O)=O)C(=O)N[C@@H](CC(O)=O)C(O)=O
: